US Binary Option Sites UK Binary Option Sites

Unexpected token h

Binary Options Trading configure: line 5876: syntax error near unexpected token `1.3,' ./configure: line 5876: `AX_FLTK(1.3, --use-gl --use-images --use-forms)' I have installed . + AllocTempHeader *h = (AllocTempHeader *)malloc(totsize); + + // Lot of the code assume the memory is set to 0 + memset(h, 0, totsize); + h->prev  Re: Parsing jSon string crashing with Unexpected Token. 5 years ago. /0. That's my answer! You have a null in your string. I used a break on error in Safari's web inspector. I called (data) and it failed. So, I called eval('d='+data). eval complained about a null character. JΛ̊KE. PS. You have  invest in blockchain technology notes 22 May 2016 1>c:/users/debh/documents/visual studio 2015/projects/smartpointers/forwarddeclaration/aircraft.h(7): error C2238: unexpected token(s) preceding ';'. This is what happened: Main included “Airport.h”; The first thing “Airport.h” included is “Aircraft.h”; While trying to include “Aircraft.h”, the compiler does not 7 Nov 2013 Thanks, John Regehr #pragma JessieIntegerModel(strict) /*@ predicate Sorted{L}(int *a, integer l, integer h) = @ /forall integer i,j; l <= i <= j < h . is the location of the previous definition #define __STDC_NO_THREADS__ 1

https://xxxx/web?#min=1&limit=80&view_type=list&model=e&action=238&menu_id=158:1 Traceback: SyntaxError: Unexpected token T in JSON at position 0 at (native) at HTMLIFrameElement.<anonymous> (https://xxxx/web/static/src/js/framework/:232:40) at 12 Nov 2015 When the WooCommerce checkout is processed it requires that gateways return an array (which is then converted into JSON) telling the checkout whether or not it was successful. It's been this way since v1. Here is a basic example from the PayPal gateway: return array( 'result' => 'success', 'redirect'  best ico dec Syntax Error Unexpected Token H. here for a quick overview of the site Help Center Detailed answers to any questions you might have Meta Discuss the workings and policies of this site About Us Learn more about Stack Overflow the company uncaught syntaxerror unexpected token json parse Business Learn more about  7 blockchain crowdfunding platforms 20 Dec 2016 really just a text file that contains the following: Code: Select all: SyntaxError: Unexpected token u in JSON at position 117<br> &nbsp; &nbsp;at (native)<br> &nbsp; &nbsp;at parse (/Users/amberwilson/dev/node-export-server-1/node_modules/body-parser/lib/types/:88:17)<br> &nbsp; 6 Apr 2016 Hi, I am having two datepickers on my web page and when user select from: and to: dates from both datepickers respectively it should come on x axis and so.

and getting this error: Uncaught SyntaxError: Unexpected token : UL9B32s3s-:183. This is the line in question: __d("IntlRomanianNumberType",["IntlVariations"],function(a,b,c,d,e,f,g){b.__markCompiled&&b.__markCompiled();var h={getNumberVariationType:function(i){var j=i%100;return i===1?g.Y/N]" read confirm if [ "$confirm" == "Y" ]; then dd bs=1M count=$data if=/dev/zero of=test conv=fdatasync elif [ "$verify" == "y" ]; then dd bs=1M count=$data if=/dev/zero of=test conv=fdatasync else echo "Exiting the test." fi } stresstest() { echo "How long is your stress(tips: Use letters along numbers like s,m,h. initial coin offering nytimes Hi all, I tried running the simplest c-programme(filename is firstc.c) as follows #include<stdio.h> main() { printf("abcd"); } and I compiled it using command gcc -o firstc firstc.c,it gets compiled and when i run it i get the following error,i don't understand,how could a simple programme such as this be erraneous  y blockchain crowdfunding platforms Thank you guys so much. [19:57:30][gameitemdatabasehelper.h:98]: Error: "Unexpected token: ideas, near line: 1 " in file: "common/ideas/" near line: 466 [19:57:30][gameitemdatabasehelper.h:98]: Error: "Unexpected token: high_command, near line: 469 " in file: "common/ideas/" near line: 21 Feb 2013 checking util.h usability yes checking util.h presence yes checking for util.h yes checking for gcc that whines about -I yes checking for glibc no checking for library containing clock_gettime no ./configure: line 4621: syntax error near unexpected token What steps will reproduce the problem?

1>c:/puttu/of/wp/addons/ofxguiextended/src/dom/Types.h(83): error C3805: 'constant': unexpected token, expected either '}' or a ',' (compiling source file /addons/ofxGuiExtended/src/containers/) 1>c:/puttu/of/wp/addons/ofxguiextended/src/dom/Types.h(212): warning C4521: 15 Apr 2010 ok I'm confused my class is empty, apart from an inclusion file, but has alot of errors that i cant understand. Here's the .h file: #ifndef creator; #define creator; #include "stdafx.h"; class creator; {; public: creator();; ~creator();; } //<------------ syntax error: a semi-colon is required here. #endif. <snip>. seeing as  blockchain trading platform 2017 APEX Office Print (AOP) - User Manual. Release 3.3 - January 2018. 1 About AOP. 1.1 Goal. APEX Office Print makes printing and exporting (docx, xlsx, pptx, pdf, html, md) in Oracle Application Express (APEX) or just in PL/SQL a lot easier. Make a template in Office, HTML or Markdown, choose data from your database and  status ico japan 20 Nov 2015 angular-websocket - :arrow_upper_left: The missing Angular WebSocket module for connecting client applications to servers by @AngularClass.2 Mar 2016 Whatever the error is, the error message must make sense and indicate what the unexpected token is. . Cr-Commit-Position: refs/heads/master@{#34431} [modify] [modify] 

I was wondering if anybody is getting the following: when I try to access the test page in an incognito browser (Chrome), I'm getting a "Uncaught SyntaxError: Unexpected token if". I tried this with IE and FF but only Chrome seems to be the one displaying the error. When looking into the error, it looks like the omarjan@lemonldap:/etc/ldap/schema$ sudo ldapadd -Y EXTERNAL -H ldapi:/// -f /tmp/cn/= SASL/EXTERNAL authentication started SASL username: gidNumber=0+uidNumber=0,cn=peercred,cn=external,cn=auth SASL SSF: 0 adding new entry "cn=sso,cn=schema,cn=config" ldap_add: Other  best icom microphone 18 Nov 2015 Sometimes when my customer try adding a product to the cart, instead of the popup that confirm that the products has been added to the cart, it opens a simi companies investing in blockchain info 18 Apr 2013 [yocto] [poky] bash: oe-init-build-env: line 33: syntax error near unexpected token `elif' < at > wrote: >>> http://ares/gitweb/?p=tools/;a=blobdiff;f=oe-init-build-env;h=68af7b5193b73627cd6ebf6196adfa685a787c38;hp=67eddcd295bd9d1adac21fc4e97506fca05f4bfa 7 Aug 2013 2.6 > checking if python has ctypes support yes > checking whether to include systemtap tracing support def > checking for dtrace no > checking sys/sdt.h usability no > checking sys/sdt.h presence no > checking for sys/sdt.h no > ./configure: line 15498: syntax error near unexpected token `2.6.19' 

Hibernate Community • View topic - Problem with ilike query and

4 Dec 2013 Sent from my iPhone >> >>> On Dec 4, 2013, at 16:24, Daan Hoogland <nd at > wrote: >>> >>> H, >>> >>> I installed the newest autoconf and libtool and automake, without a >>> changed result. Should I configure: line 17162: syntax error near unexpected token `GLIB,' >>> . n best icons 25 Feb 2013 configure: line 17684: syntax error near unexpected token `RANDR,' ./configure: line CC mali_dri.c:39:21: fatal error: xf86drm.h: No such file or directory Code: Select all: root@odroid-x:/usr/include/ump/# ln -s /usr/src/linux-headers-3.0.63-odroidx/include/config/mali400/ump.h. Run make  best ico forums 2 Aug 2013 configure: line 7079: syntax error near unexpected token `CPPUNIT,' > ./configure: line Unfortunately, when I do “shutdown –h +0”, the ups is never shut down. > After a little I'm ussing upssched in , do I need to create the flag with my > script before calling the shutdown –h +0? How (it's 

Hi, I am seriously stuck with this. I have created a webservice in Java and I am trying to use the response of the webservice in an html page. So I am. 50x50 icon Do not name your script test , for example! Why? test is the name of a UNIX®-command, and most likely built into your shell (it's a built-in in Bash) - so you won't be able to run a script with the name test in a normal way. Don't laugh! This is a classic mistake :-)  ico insurance To Geoiige S. Dana, Esq. and Doct. John McCat.l, and others. Gentlemen : — I have received your very kind notes, requesting a copy for publication of the " Lecture" which I had the honor of delivering before the " Young Men's Association" in this city. For this unexpected token of regard for me and my humble effort on that 

84 typedef std::vector<AsmToken> MCAsmMacroArgument;. 85 typedef std::vector<MCAsmMacroArgument> .. current lexer position to that given by /p Loc. The. 358 /// current token is not set; clients should ensure Lex() is called .. 744 "Unexpected active macro instantiation!"); 745. 746 // Restore the saved diagnostics  who is investing in blockchain info Uncaught SyntaxError: Unexpected token < :16. SON :16. $ta :171. ----------PHP error log----------. [01:15:41] PHP Fatal error: Allowed memory size of 67108864 bytes exhausted (tried to allocate 50000001 bytes) in Unknown on  token payment 24 Jul 2014 Problem : 'Unhandled exception: [SyntaxError: Unexpected token ILLEGAL]'. Solution : This can be many things, from a weird unicode character not appearing in your editor to a simple extra double-quote at the wrong place. I suggest you commit, then go back to old revisions until it doesnt do it anymore.

%H:%M:%S,%3N")|eval EndTime=strftime(endTime,"%Y-%m-%d %H:%M:%S,%3N"); |table id,Info,StartTime,EndTime,responseTime,StatusCode,StatusMessage,source,corpEntCd,Costlvlpctl,cptCode,GroupNbr,memZipCode,ProcChrgamt,ProvZipCode,SectionNbr,ServiceDate,TretCatCd,TretCatName  4 real icon checking jpeglib.h usability yes checking jpeglib.h presence yes checking for jpeglib.h yes checking for jpeg_CreateCompress in -ljpeg yes checking gd.h usability no checking gd.h presence no checking for gd.h no ./configure: line 13699: syntax error near unexpected token `GDK_PIXBUF,gdk-pixbuf-2.0' . 3 initial coin offerings /bin/sh: -c: line 0: syntax error near unexpected token `('. the above error is pretty clear I guess C:/SiliconLabs/SimplicityStudio/v3/developer/sdks/efm32/v2/emlib/inc/em_adc.h:576:26: error: unknown type name 'uint32_t' uint8_t ADC_TimebaseCalc(uint32_t hfperFreq);. 0. kutuz. Level 3. Replied Apr 22 

unexpected token `foreign' | SmallNetBuilder Forums

17 Aug 2015 ReactJS has been taking the world of front end development by storm. Described by its own homepage as the V in MVC, React allows you to build reusable UI components and makes maintaining changes in your data's state effortless by abstracting the DOM. Combined with a bundler utility like Webpack,  5 icon dock ios 11 15 Oct 2015 Remember back in 2013, when reading files on “mobile” was new and everyone was wondering how the h*ck to do it? That's when Martin Destagnol, entrepreneur and engineer, built Folders. And seven… v tokens for conditional pseudonymity in vanets 1 Sep 2016 I`m getting an error at line 17 unexpected token: ')' and I cant figure out why. Can someone please help? 04, Settings__c ts = [ SELECT Name, Client_Secret__c , ConsumerKey__c , Password__c , SecurityToken__c , Username__c from Settings__c ]; 34, HttpResponse res 1 = h 1 .send(req 1 ); 

9 Mar 2011 I was getting "Unexpected token ILLEGAL" so I added output of the 'chunk' variable on line 289, and it's borking on an HTML 404 page. (Each line comes through as a chunk and fails to parse as JSON.) I'm not that familiar yet with or with websockets, but presumably I have something  cryptocurrency za 18 Feb 2015 Using latest master with only modification of setting importProxyUrl to "" , as CORS headers are set by my server already: Access-Control-Allow-Origin: * Access-Control-Allow-Headers: Authorization, X-User-Uuid, X-Tenant-Id, Content-Type Access-Control-Allow-Methods: POST, GET, PUT, DELETE. token blockchain Error in mobile app: "Unexpected token < in JSON at position 1"

Bonjour à tous, Linux Ubuntu Server v 10.10. J'ai un petit soucis de programmation ; je souhaite installer un programme que j'ai récupéré sur Internet mais avant de faire le Make ou le Make Install, je dois lancer de ./configure. Quand je le lance, il me marque plusieurs lignes et s'arrête pour marquer  u token salesforce 17 Feb 2007 C:/Program Files/Microsoft Visual Studio 8/VC/PlatformSDK/include/winver.h(17) : error C2059: syntax error : 'string' C:/Program Files/Microsoft Visual Studio 8/VC/PlatformSDK/include/winver.h(17) : error C2334: unexpected token(s) preceding '{'; skipping apparent function body. C:/Program Files/Microsoft  token new problems lyrics However, when I want to include <ilcplex/ilocplex.h> and build the solution, VS 2017 (15.5.2) throws C2760 (Syntax error: unexpected token ")" in line 88 of ilconcert/iloiterator.h. I've already compared the project setting of my project and the ones from the examples, but I haven't managed to find differences.

8 May 2017 dataCompensacao, ualizacao, , pensacao" + "FROM Contrato c, Historico h" + "WHERE toId = toId" + "AND 1=1";. THE EXCEPTION: Caused by: ception: unexpected token: C at rror(Unknown Source) at t blockchain crowdfunding platforms JavaScriptException in onModuleLoad: (SyntaxError) : Unexpected token m :875 Uncaught .. json=(jsontext); doD3(); }; var tree = () .size([h, w]); // turn on its side var diagonal = al() .projection(function(d) { return [d.y, d.x]; }); var  v icon font awesome Sanctuary v0.14.1. Refuge from unsafe JavaScript. Overview; Types. Type representatives. Type checking; API. create :: { checkTypes :: Boolean, env :: Array Type } -> Module; env :: Array Type; Placeholder. __ :: Placeholder. Classify. type :: Any -> { namespace :: Maybe String, name :: String, version :: NonNegativeInteger } 

28 Feb 2017 Hello All; I am trying to get an image swap code that I found, that will work with dynamic content. When I click on one of the images, I get the --- (Google Chrome) Javascript - Uncaught SyntaxError: Unexpected token } (Firefox) SyntaxError: expected expression, got end of script. THE Errors are on the Image  initial coin offering book 5 Mar 2014 I am making POST REST call at swagger UI and the response is Hello World But UI is getting is not display response and the console is giving the following exception: Uncaught SyntaxError: Unexpected token H. I have tried to debug and I think it is related to the following line (); blockchain investment news 18 Nov 2015 Do you see the following error in your console and wonder what's wrong? Uncaught SyntaxError: Unexpected token Most likely, this error occurs when the input.

Hi, I'm (really) new with processing. Can anyone help me with this code? please :) I cannot find why I get unexpected token: void() in this code: import *; Capture webcam; int w=400; int h=400; int pixn=w*h; int keyhits; PImage img; int i= 0. void setup() { size(w, h); webcam = new  invest in blockchain technology 2016 Additionally when I hit the I receive an "Unexpected token < in JSON at position 0" error init :140 GET http://gisdev01/LifeSupportApplication/LifeSupportApplication/?wab_dv=2.1 404 (Not Found)h @ :140_tryLoadConfig @ ?wab_dv=2.1:236loadConfig  ico yahoo GetToken() / mupGetErrorToken() - returns the token associated with the error (if applicable); exception. The first column contains the enumeration values as defined in the enumeration mu::EErrorCodes located in the file muParserError.h. ecUNEXPECTED_VAR, 6, An unexpected variable token has been found.

Error C4430 missing type specifier – int assumed. Note: C++ does not support default-int UE4 c:/users/karan/documents/ue-4.15.1-release/engine/plugins/fmodstudio/source/fmodstudioeditor/private/sequencer/FMODEventControlTrackEditor.h 37. Error C2238 unexpected token(s) preceding ';' UE4  7 icons cinta cuma satu 12 Nov 2011 Subject: [mongodb-user] mongodump Error -bash: syntax error near unexpected token `(' Hey, Using mongodump to dump my Mongodb Data. Like this: mongodump -h localhost:27017 -d esbdb -c myc -q {"ttime":{"$lt":ISODate("2011-11-06T16:00:00Z")}} -o /root/workpro/esbdb_backup/  custom thopter tokens 26 May 2017 import 'bootstrap/dist/css/'; import 'bootstrap-vue/dist/bootstrap-'; (BootstrapVue); new Vue({ el: '#app', render: h => h(App) }); bootstrap/dist/css/ Module parse failed: /Users/bparanj/videos/blov/node_modules/bootstrap/dist/css/ Unexpected token 

Gentoo Forums :: View topic - [SOLVED] Libtool problem

Unexpected Token” means that you used a symbol that JavaScript wasn't expecting. Make sure you haven't accidentally typed the wrong symbol somehwere, and make sure all of your opening parenthesis and such also have a closing parenthesis in the ri upcoming icos to watch reddit 29 Jun 2016 directive .fpu neon icon 8 installer manual Navigated to file:///C:/Users/AnJia/AppData/Local/GitBook_Editor/app-7.0.11/resources/ap…Vyc1xcQW5KaWFcXEdpdEJvb2tcXExpYnJhcnlcXGFuamlhMDUzMlxcamhpcHN0ZXItYm9vayJ9. Uncaught SyntaxError: Unexpected token in JSON at position 396. [2017-03-13T07:22:24.091Z] [init] info: running desktop version.

12 Jun 2013 Created attachment 123276 [details] Screenshot of unexpected token. The editor show error if i use "override" keyword from C++11 standard. See screenshot in attachment. In project properties C++ standard set to C++11 for code assistance. Comment 1 Vladimir Voskresensky 2012-08-18 14:15:22 UTC. ico tracker net 3 Mar 2012 This was reported as Debian bug #659963 : There is a syntax error in the provided file that shows up like this: > root@kdc01:~# zcat /usr/share/doc/samba-doc/examples/LDAP/ | ldapadd -Y EXTERNAL -H ldapi:/// > SASL/EXTERNAL authentication started > SASL username:  invest in blockchain startups 7.5

2 Sep 2007 libtool: eval: line 4305: syntax error near unexpected token `|' ../../libtool: eval: line 4305: `/usr/bin/nm -B .libs/libgstmms_la-gstmms.o | | /bin/sed 's/. .. make use of stdint.h in _stdint.h (assuming C99 compatible system) checking for GLIB yes checking for LIBOIL yes checking for GST yes configure:  blockchain development platforms maps 23 Feb 2016 ception: SEMANTIC_ERROR[unexpected token: S required: )] at JDBCSQLException(:824) ~[lens-driver-jdbc-2.5.0-beta-:2.5.0-beta-SNAPSHOT] at ico heal 6 Feb 2006 get the following error: > > # make > /bin/sh: -c: line 0: syntax error near unexpected token `(' > /bin/sh: -c: line 0: `set -e; echo ' CHK include/linux/version.h'; > mkdir -p include/linux/; if [ `echo -n "2.6.16-rc2 .file null > .ident GCC:(GNU)4.0.320060128(prerelease)(Debian4.0.2-8) .section > -stack, 

31 Mar 2016 checking linux/soundcard.h usability yes checking linux/soundcard.h presence yes checking for linux/soundcard.h yes checking for pg_config no ./configure: line 42914: syntax error near unexpected token `$PJPROJECT_DIR' ./configure: line 42914: ` PJPROJECT_CONFIGURE($PJPROJECT_DIR)'  how to invest in blockchain xp I have built FS on my Mac ok for many times but fails today, I think it might be related to the recent change of the open ssl stuff. checking whether the gcc linker (/usr/libexec/gcc/i686-apple-darwin10/4.2.1/ld) supports shared libraries yes checking dynamic linker characteristics darwin10.8.0 dyld checking how to hardcode  initial coin offering indonesia EDIT: So since people seem to still be finding this question 3+ years after I asked it and I now know a significant amount more about Javascript here is a solution that I hope will work for any of you that have a similar Unexpected Token error. Basically various things could be added to your code if you run it 

Debugging “unexpected token” in WooCommerce 2.4+ – Mike Jolley

24 Mar 2016 unexpected end o f file -bash: $'/037/213/b/b': command not found -bash: /etc/bash_completion.d/dphys-: line 2: syntax error near unexp ected token `&' -bash: /etc/bash_completion.d/dphys-: line 2: `&Qdphys-swapfileu·_K+1 ···)[  ico list calendar I need to pass a structure to an OCALL from within the enclave. The structure is defined in "../TorchHost/gpu_glue_types.h" w.r.t. to the .edl file, // gpu_glue_types.h struct gpu_iMat { int *ptr; int rows; int cols; }; // typedef struct gpu_iMat gpu_iMat; And the .edl file, iphone 5 icons status bar 12 Dec 2017 I've trying to use the Reality Caputre API to convert 2d photo to 3d model with example on: -Forge/photo-to-3d-sample. But when after I finish authorize, the browser cannot load the engine with error at the console: SyntaxError: Unexpected token o in JSON at position 

9 Jan 2015 ERROR in ./~/css-loader!./~/cssnext-loader!./src/ Module build failed: SyntaxError: Unexpected token h at (native) at tring (//node_modules/css-loader/node_modules/loader-utils/:152:14) at(//node_modules/css-loader/:47:25 at e (native) at  monster hunter 4 status icons 23 Jan 2017 I got issue with run appium on real iOS device. The issue is Signing for "WebDriverAgentRunner" requires a development team. Select a development team in the project editor. Code signing is required for product type… j ico cryptography /Users/huhai/dev/sources/video_opensource/x265_new/x265_dev/source/common/arm/dct-a.S:26:17: error: unexpected token in x265::MotionReference' /Users/shiyi/Desktop/x265_dev/source/encoder/reference.h:38: error: forward declaration of 'class x265::MotionReference' 

not able to parse (Unexpected Token). returns back error: # Ruby code in IRB require 'json' time_now = me("%a, %d %b %Y %H:%M:%S GMT") hash = '"date":' + _s hash_json = (hash). Error: JSON::ParserError: 743: unexpected token at 'Sun, 14 May 2017 21:19:02  1 tokenpay to usd 19 Mar 2017 I have tried to configure apcupsd to read my APC UPS, but I cannot seem to get it working. Running apcaccess works fine and shows me all current information with the status of ONLINE SLAVE. I am running HA on a rasp p… token vs coin p2.c: line 5: syntax error near unexpected token `(' ./p2.c: line 5: `void *printMessage( void *thread_id );' here are the first few lines of the code Expand|Select|Wrap|Line Numbers. #include <stdio.h>; #include <stdlib.h>; #include <pthread.h>; void *printMessage( void *thread_id );; int main ( int argc, char 

18 Sep 2012 Test if problem solved using echo $(ls) command. If yes, then using /tools/bin/bash --login +h to lunch the new bash. Also see: --support@ · -from-scratchs-bash-problem-syntax-error  g best icon Error: cannot open file “CLHEP/Vector/Rotation.h” /home/pozzobon/geant4/9.2/source/global/management/include/:43: Error: class,struct . sh: -c: line 0: syntax error near unexpected token newline' sh: -c: line 0: g++ -E -C “-DG__LINUX=1” “-DG__GNUC=4” “-DG__GNUC_MINOR=1”  ico unlimited Hello,. I am receiving "BADRESPONSE: Unexpected token {" error from the attached text on Chrome, but works well on ff and IE. The error is generated when i render a control from code behind in aspx with the bellow code. ge(events); ();. Anybody with 

5 Nov 2011 elif [ "${option}" = "b" ]; then echo rm -rf "${bkpath}/" rm -rf "${bkpath}/" echo " [Deleting Old Backups] Finished…" echo mysqldump -h ${server} --user=${user} --port=${port} --password=${pass} ${ldb} > "$bkpath}/" echo " [Backing Up Logon Database]  wow token sale At first, I have a confusing error that it can't fetch the schema, but then I see on the README that I've got to make a token. I do that and it works fine. When I try to use the 'app' api in playground however, I get the following unhelpful error: Unexpected token H in JSON at position 0. traceback looks like this: ico 480p configure: eval: line 2651: syntax error: unexpected end of file configure: WARNING: `missing' script is too old or missing checking for a thread-safe yes checking for sys/types.h yes checking for sys/stat.h yes checking for stdlib.h yes checking for string.h yes checking for memory.h yes checking for 

Syntax Error Near Unexpected Token `(' - C And C++ | Dream.In.Code

21 Aug 2014 bash: PROMPT_COMMAND: line 8: syntax error near unexpected token `;' bash: PROMPT_COMMAND: line 8: `dbus-send --type=method_call --session --dest=on-terminal /net/launchpad/pantheon_terminal sFinished string:$PANTHEON_TERMINAL_ID  ico stats unit json/json.h usability no checking json/json.h presence no checking for json/json.h no checking json-c/json.h usability yes checking json-c/json.h presence yes checking for json-c/json.h yes checking for json_object_get in -ljson-c yes ./configure: line 16565: syntax error near unexpected token `PROTOBUFC,' . b token sales 13 Apr 2016 I am currently following along the Video 'Using Services To Get Data' at the Angular Basics Cours. But I can't get along, because there is an error that constantly occurs. Can you please help me to see what is wrong. I am very frustrated already!!! And actually I can not finish this course as I don't know the 

#include "tools/gn/token.h". const char kGrammar_Help[] = "Language and .. at the top of that describes how each token dispatches if it's. // seen as either a prefix or infix operator, and if it's infix, .. if (prefix == nullptr) {. *err_ = Err(token,. std::string("Unexpected token '") + ().as_string() +. std::string("'"));. d ico coins The middlewares will: extract the ID Token from the request; retrieve the OIDC provider (OP) configuration and signing keys; validate the token and provide the user identity and Handler func AuthenticateUser(conf *Configuration, h UserHandler) http. .. ValidationErrorInvalidIssuerType // Unexpected token issuer type. token t 38 tubular t :: binary >>, cap?, output_str) do _capitalize(t, false, output_str <> se("" <> <<h>> )) end. Like the terseness of Dave's solution. However, note that the reg-ex should use a ~ and not % "ab. c" |> (%r{/./s+}) ** (SyntaxError) iex:3: unexpected token: "/" (column 26, codepoint U+005C)

20 Feb 2013 configure: line 16325: syntax error near unexpected token `soup,' ./configure: line 16325: ` PKG_CHECK_MODULES(soup, libsoup-2.4)' I'm not a configure expert, but it looks like there is a null if/then directive at line 16315not sure if that's allowed: ac_fn_c_check_header_mongrel "$LINENO" "unbound.h"  blockchain crowdfunding game 9 Sep 2017 Linux commands for intermediate users: Once you become accustomed with using Linux, these commands will be of immense help. cryptocurrency forum I could not set-up $map as an array containing objects, because Twine then says there's an error ("Error: <<set>>: bad evaluation: Unexpected token"). . what's |h and |! do? As I noted with the example, they're part of the table markup. Specifically, the TiddlyWiki table markup (I could have used HTML table 

19 Sep 2014 CHK include/generated/utsrelease.h UPD include/generated/utsrelease.h CC kernel/bounds.s clang: warning: argument '-fcatch-undefined-behavior' is deprecated, use '-fsanitize=undefined-trap -fsanitize-undefined-trap-on-error' instead kernel/bounds.c:18:2: error: unexpected token at start of statement  k icon app 27 May 2015 configure: line 2202: syntax error near unexpected token linux-ftools,' . /usr/bin/grep -E checking for ANSI C header files yes checking for sys/types.h yes checking for sys/stat.h yes checking for stdlib.h yes checking for string.h yes checking for memory.h yes checking for strings.h yes checking  google calendar .ico download 16 Apr 2016 /home/bsharmi6/ChIPseqTools/Trimmomatic-0.36/trimmomatic-: line 3: syntax error near unexpected token `$'/a/217/245/234D/312/017/265/026/234/311{/234T/315./204/024/266ת/353/2179/343/354/003PK/003/004'' /home/bsharmi6/ChIPseqTools/Trimmomatic-0.36/trimmomatic-: line 3:h?

1>C:/Imagination/PowerVR_Graphics/PowerVR_SDK/SDK_2017_R1/Framework/PVRCore/Base/RefCounted.h(673): error C2238: unexpected token(s) preceding ';' 1>C:/Imagination/PowerVR_Graphics/PowerVR_SDK/SDK_2017_R1/Framework/PVRCore/Base/RefCounted.h(674): error C2061: syntax  ico stats xbox one 29 Jul 2017 [00:03:32][:48]: PDX ONLINE BACKEND: Failed to create texture from image data [00:04:31][gameitemdatabasehelper.h:98]: Error: "Unexpected token: Mittelafrika_is_on_their_own, near line: 725 s blockchain companies to invest in 2017 8 Jan 2017 SyntaxError: Unexpected token import. File: "/data/data/-, line: 45, column: 0. StackTrace: ActivityThread$Message(:1321) at chMessage(:102) at (:135) at